ontology enhancement
type: Concept
definition: the task/process of improving an ontology, typically by adding new relations or entities
preferred label: βελτίωση οντολογίας @el
in scheme: CLARIN:EL Dictionary
broader: knowledge acquisition

CLARIN:EL Dictionary
type: ConceptScheme
preferred label: Λεξικό CLARIN:EL @el

knowledge acquisition
type: Concept
preferred label: απόκτηση γνώσης @el
narrower: ontology enhancement