CLARIN:EL Dictionary
type: ConceptScheme
preferred label: Λεξικό CLARIN:EL @el

orthographic transcription
type: Concept
definition: the task/process of transcribing a source language word/phrase or an audio segment into the standard spelling system of a target language
preferred label: ορθογραφική μεταγραφή @el
in scheme: CLARIN:EL Dictionary
broader: transcription

transcription
type: Concept
preferred label: μεταγραφή @el
narrower: orthographic transcription