paralanguage annotation
type: Concept
definition source: adapted from https://www.dictionary.com/browse/paralanguage
definition: the task/process of annotating paralinguistic features, i.e. vocal features that accompany speech and contribute to communication but are not generally considered to be part of the language system (e.g. vocal quality, loudness, and tempo); facial expressions and gestures are also considered as paralinguistic features
preferred label: επισημείωση παραγλώσσας @el
in scheme: CLARIN:EL Dictionary
broader: speech annotation

CLARIN:EL Dictionary
type: ConceptScheme
preferred label: Λεξικό CLARIN:EL @el

speech annotation
type: Concept
preferred label: επισημείωση ομιλίας @el
narrower: paralanguage annotation

definition source
comment: Formal citation, e.g. identifier in external database to indicate / attribute source(s) for the definition. Free text indicate / attribute source(s) for the definition. EXAMPLE: Author Name, URI, MeSH Term C04, PUBMED ID, Wiki uri on 31.01.2007
label: πηγή ορισμού @el