polarity labelling
type: Concept
definition: the task/process of adding to units of a text (especially in sentiment-intensive texts) tags that indicate polarity (negative, positive, neutral, mixed)
alternative label: polarity labeling
preferred label: επισημείωση πολικότητας @el
in scheme: CLARIN:EL Dictionary
broader: semantic annotation

CLARIN:EL Dictionary
type: ConceptScheme
preferred label: Λεξικό CLARIN:EL @el

semantic annotation
type: Concept
preferred label: σημασιολογική επισημείωση @el
narrower: polarity labelling