information extraction
type: Concept
preferred label: εξαγωγή πληροφορίας @el
narrower: relation extraction

relation extraction
type: Concept
note: Automated or human-assisted acquisition of relations between concepts from textual or other data, usu. within a selected domain.
definition: the task/process of identifying and classifying relation mentions between entities in text and/or data
alternative label: relationship extraction
preferred label: εξαγωγή σχέσεων @el
in scheme: CLARIN:EL Dictionary
broader: information extraction

CLARIN:EL Dictionary
type: ConceptScheme
preferred label: Λεξικό CLARIN:EL @el