semantic relation labelling
type: Concept
in scheme: CLARIN:EL Dictionary
alternative label: semantic relation labeling
alternative label: σήμανση σημασιολογικών σχέσεων @el
alternative label: semantic relation annotation
alternative label: semantic relation tagging
preferred label: επισημείωση σημασιολογικών σχέσεων @el
broader: semantic annotation
definition: the task/process of attaching tags indicating the semantic relation that holds between units of a text

CLARIN:EL Dictionary
type: ConceptScheme
preferred label: Λεξικό CLARIN:EL @el

semantic annotation
type: Concept
preferred label: σημασιολογική επισημείωση @el
narrower: semantic relation labelling