CLARIN:EL Dictionary
type: ConceptScheme
preferred label: Λεξικό CLARIN:EL @el

semantic role labelling
type: Concept
definition: the task/process of attaching labels that correspond to the roles that the arguments of a predicate take in an event
alternative label: επισήμανση σημασιολογικών ρόλων @el
alternative label: semantic role tagging
alternative label: semantic role annotation
alternative label: semantic role labeling
in scheme: CLARIN:EL Dictionary
preferred label: επισημείωση σημασιολογικών ρόλων @el
broader: semantic annotation

semantic annotation
type: Concept
preferred label: σημασιολογική επισημείωση @el
narrower: semantic role labelling