CLARIN:EL Dictionary
type: ConceptScheme
preferred label: Λεξικό CLARIN:EL @el

operation with multimedia input or output
type: Concept
preferred label: λειτουργία με είσοδο ή έξοδο πολυμέσων @el
narrower: sign language recognition

sign language recognition
type: Concept
definition: the task/process of recognizing from images and videos hand gestures performed in sign language
preferred label: αναγνώριση νοηματικής γλώσσας @el
in scheme: CLARIN:EL Dictionary
broader: operation with multimedia input or output