speech recognition
type: Concept
preferred label: αναγνώριση ομιλίας @el
narrower: speaker verification

speaker verification
type: Concept
definition: the task/process of verifying that a certain person is speaking
preferred label: επαλήθευση ομιλητή @el
in scheme: CLARIN:EL Dictionary
broader: speech recognition

CLARIN:EL Dictionary
type: ConceptScheme
preferred label: Λεξικό CLARIN:EL @el