definition source
comment: Formal citation, e.g. identifier in external database to indicate / attribute source(s) for the definition. Free text indicate / attribute source(s) for the definition. EXAMPLE: Author Name, URI, MeSH Term C04, PUBMED ID, Wiki uri on 31.01.2007
label: πηγή ορισμού @el

CLARIN:EL Dictionary
type: ConceptScheme
preferred label: Λεξικό CLARIN:EL @el

training of machine learning models
type: Concept
definition source: adapted from http://docs.aws.amazon.com/machine-learning/latest/dg/training-ml-models.html
definition: the task/process of creating Machine Learning (ML) models by providing a ML algorithm with training data that help the algorithm discover patterns in data, and construct the appropriate models using these discoveries
preferred label: εκπαίδευση μοντέλων μηχανικής μάθησης @el
in scheme: CLARIN:EL Dictionary
broader: language modelling

language modelling
type: Concept
preferred label: γλωσσική μοντελοποίηση @el
narrower: training of machine learning models