word sense disambiguation
type: Concept
note: Word Sense Disambiguation is a subtask of semantic tagging, which consists of assigning a semantic class (sense) to a lexical item as specified by a semantic lexicon. If the semantic lexicon specifies more than one sense for a particular lexical item, a disambiguation procedure is needed to decide upon the most appropriate sense(s) for any given instance of the lexical item in text. WSD is not a self-contained application, but it may be included as an integrated part of a semantic processor.
definition: the task/process of identifying which sense of a word with multiple meanings is used in a particular context; the selection of the sense is made from a list of the word's senses
alternative label: WSD
preferred label: αποσαφήνιση λεξικής σημασίας @el
in scheme: CLARIN:EL Dictionary
broader: support operation

CLARIN:EL Dictionary
type: ConceptScheme
preferred label: Λεξικό CLARIN:EL @el

support operation
type: Concept
preferred label: λειτουργία υποστήριξης @el
narrower: word sense disambiguation