Λεξικό CLARIN:EL
preferred label: CLARIN:EL Dictionary @en
type: ConceptScheme

επισημείωση θέματος ερώτησης
in scheme: Λεξικό CLARIN:EL
definition: the task/process of attaching tags to the segment of a question that functions as the topic of that question @en
definition: η διαδικασία προσθήκης ετικετών στο συγκεκριμένο σημείο μίας ερώτησης, που λειτουργεί ως το βασικό θέμα (θεματική) της ερώτησης αυτής
preferred label: annotation of question topics @en
type: Concept
broader: σημασιολογική επισημείωση
alternative label: επισημείωση θεματικού στόχου ερώτησης
alternative label: annotation of question topical targets @en

σημασιολογική επισημείωση
preferred label: semantic annotation @en
type: Concept
narrower: επισημείωση θέματος ερώτησης