annotation of speaker turns
definition: the task/process of marking locations in speech where there is a change of speakers
definition: η διαδικασία σήμανσης των σημείων μιας συνομιλίας όπου παρατηρείται αλλαγή των συνομιλητών @el
preferred label: επισημείωση εναλλαγής ομιλητών @el
in scheme: CLARIN:EL Dictionary
broader: speech annotation
type: Concept

CLARIN:EL Dictionary
preferred label: Λεξικό CLARIN:EL @el
type: ConceptScheme

speech annotation
preferred label: επισημείωση ομιλίας @el
type: Concept
narrower: annotation of speaker turns