Λεξικό CLARIN:EL
preferred label: CLARIN:EL Dictionary @en
type: ConceptScheme

σημασιολογική επισημείωση
preferred label: semantic annotation @en
type: Concept
narrower: επισημείωση κειμενικής συνεπαγωγής

επισημείωση κειμενικής συνεπαγωγής
definition: the task/process of annotating textual entailments, most usually indicating whether a text entails or contradicts a hypothesis sentence or does neither @en
definition: η διαδικασίας επισημείωσης κειμενικών συνεπαγωγών, συνήθως με σκοπό να προσδιοριστεί εάν ένα κείμενο επιβεβαιώνει ή διαψεύδει μια υποθετική πρόταση ή τίποτα από τα δύο
preferred label: annotation of textual entailment @en
in scheme: Λεξικό CLARIN:EL
broader: σημασιολογική επισημείωση
type: Concept