information extraction
preferred label: εξαγωγή πληροφορίας @el
type: Concept
narrower: bot detection

CLARIN:EL Dictionary
preferred label: Λεξικό CLARIN:EL @el
type: ConceptScheme

bot detection
definition: the task/process of identifying segments of text or speech discourse that have been uttered by bots
definition: η διαδικασία αναγνώρισης αποσπασμάτων γραπτού κειμένου ή προφορικού λόγου που έχουν παραχθεί ή εκφωνηθεί από ρομπότ @el
preferred label: ανίχνευση μποτ @el
in scheme: CLARIN:EL Dictionary
broader: information extraction
type: Concept