information extraction
preferred label: εξαγωγή πληροφορίας @el
type: Concept
narrower: computational argumentation

CLARIN:EL Dictionary
preferred label: Λεξικό CLARIN:EL @el
type: ConceptScheme

argument mining
preferred label: αναλυτική επιχειρηματολογίας @el
type: Concept
broader: computational argumentation

computational argumentation
definition: the task/process of identifying and representing argumentation in text, so that systems have the ability to use them in tasks, such as automated logical reasoning
definition: η διαδικασία αναγνώρισης και αναπαράστασης επιχειρηματολογίας σε ένα κείμενο, ώστε τα συστήματα να έχουν την δυνατότητα να την χρησιμοποιήσουν σε επιτέλεση δοκιμασιών όπως η αυτόματη εξαγωγή λογικών επιχειρημάτων @el
preferred label: υπολογιστική επιχειρηματολογία @el
narrower: argument mining
in scheme: CLARIN:EL Dictionary
broader: information extraction
type: Concept