conjugation
source: https://www.greek-language.gr/greekLang/modern_greek/tools/lexica/terms/search.html
definition: the act of generating (listing in a prescribed order) the various inflectional forms of a word
definition: η πράξη της παραγωγής (σε μορφή λίστας σε καθορισμένη σειρά) διαφόρων κλιτικών τύπων μίας λέξης @el
preferred label: κλίση @el
in scheme: CLARIN:EL Dictionary
broader: natural language generation
type: Concept

CLARIN:EL Dictionary
preferred label: Λεξικό CLARIN:EL @el
type: ConceptScheme

natural language generation
preferred label: παραγωγή φυσικής γλώσσας @el
type: Concept
narrower: conjugation