conversational systems building
alternative label: κατασκευή πρακτόρων διαλόγου @el
alternative label: κατασκευή εικονικών πρακτόρων @el
alternative label: conversational agents building
alternative label: dialog systems building
alternative label: embodied agents building
alternative label: dialogue systems building
alternative label: κατασκευή ενσώματων πρακτόρων @el
alternative label: virtual agents building
alternative label: chatbots building
type: Concept
preferred label: κατασκευή διαλογικών συστημάτων @el
broader: human computer interaction
definition: all activities related to the creation of conversational/dialogue systems (i.e. computer systems intended to converse with humans, through one or more communication modalities, such as text, speech, graphics, haptics, gestures)
definition: Όλες οι δραστηριότητες που συνδέονται με τη δημιουργία συστημάτων διαλόγου/συζήτησης (π.χ. υπολογιστικά συστήματα κατασκευασμένα για να συνομιλούν με ανθρώπους, μέσω ενός ή περισσότερων μέσων επικοινωνίας όπως κείμενο, διάλογος, γραφήματα, χειρονομίες, αφή) @el
in scheme: CLARIN:EL Dictionary

CLARIN:EL Dictionary
preferred label: Λεξικό CLARIN:EL @el
type: ConceptScheme

human computer interaction
preferred label: επικοινωνία ανθρώπου-μηχανής @el
type: Concept
narrower: conversational systems building