Λεξικό CLARIN:EL
preferred label: CLARIN:EL Dictionary @en
type: ConceptScheme

διαχωρισμός δεδομένων
definition: the task/process of splitting (partitioning) available data into parts, usually for cross-validatory purposes, e.g. in order to use one part for training purposes and the other for evaluation @en
definition: η διαδικασία της τμηματοποίησης (τεμαχισμού) των διαθέσιμων δεδομένων σε μέρη, συνήθως για σκοπούς διασταυρωμένης επικύρωσης, π.χ. με σκοπό να χρησιμοποιηθεί το ένα τμήμα για εκπαίδευση και το άλλο για αξιολόγηση
preferred label: data splitting @en
in scheme: Λεξικό CLARIN:EL
broader: λειτουργία υποστήριξης
type: Concept

λειτουργία υποστήριξης
preferred label: support operation @en
type: Concept
narrower: διαχωρισμός δεδομένων