dialogue modelling
definition: the task/process of building models of dialogues to be used in dialogue systems
definition: η διαδικασία της κατασκευής διαλογικών μοντέλων με στόχο τη χρήση τους σε διαλογικά συστήματα @el
note: A Dialogue model is a system that simulates the behavior of dialogue participants. This includes formal models that instantiate linguistic theories of dialogue interaction and statistical models of dialogue behaviors.
note: Ένα διαλογικό μοντέλο είναι ένα σύστημα προσομοίωσης της συμπεριφοράς των συνομιλιτών ενός διαλόγου. Αυτό περιλαμβάνει επίσημα μοντέλα που αναπαριστούν γλωσσολογικές θεωρίες της διάδρασης μέσω διαλόγων και στατιστικά μοντέλα διαλογικής συμπεριφοράς @el
preferred label: μοντελοποίηση διαλόγου @el
broader: language modelling
type: Concept
in scheme: CLARIN:EL Dictionary
alternative label: dialog modeling

CLARIN:EL Dictionary
preferred label: Λεξικό CLARIN:EL @el
type: ConceptScheme

language modelling
preferred label: γλωσσική μοντελοποίηση @el
type: Concept
narrower: dialogue modelling