document comparison
definition: the task/process of comparing different versions of the same document
definition: η διαδικασία σύγκρισης διαφορετικών εκδοχών του ίδιου εγγράφου @el
preferred label: σύγκριση εγγράφων @el
in scheme: CLARIN:EL Dictionary
broader: support operation
type: Concept

CLARIN:EL Dictionary
preferred label: Λεξικό CLARIN:EL @el
type: ConceptScheme

support operation
preferred label: λειτουργία υποστήριξης @el
type: Concept
narrower: document comparison