εξαγωγή πληροφορίας ειδικού σκοπού
preferred label: extraction of domain-specific information @en
in scheme: Λεξικό CLARIN:EL
broader: εξαγωγή πληροφορίας
narrower: εξαγωγή στοιχείων χρηματοδότησης
definition: extraction of information that pertains to specific domains/disciplines; it can be used combined with "Annotation type" to specify the type of information extracted @en
definition: εξαγωγή πληροφορίας που αφορά συγκεκριμένα πεδία/ειδικότητες, και που μπορεί να χρησιμοποιηθεί σε συνδυασμό με το είδος επισημείωσης για να συγκεκριμενοποιήσει το είδος της πληροφορίας που εξάγεται
source: https://www.cs.uoi.gr/~pitoura/courses/ap/ap16/slides/ch1.pdf
type: Concept

εξαγωγή στοιχείων χρηματοδότησης
preferred label: extraction of funding information @en
type: Concept
broader: εξαγωγή πληροφορίας ειδικού σκοπού

εξαγωγή πληροφορίας
preferred label: information extraction @en
type: Concept
narrower: εξαγωγή πληροφορίας ειδικού σκοπού

Λεξικό CLARIN:EL
preferred label: CLARIN:EL Dictionary @en
type: ConceptScheme