Λεξικό CLARIN:EL
preferred label: CLARIN:EL Dictionary @en
type: ConceptScheme

λειτουργία με είσοδο ή έξοδο πολυμέσων
preferred label: operation with multimedia input or output @en
type: Concept
narrower: ανίχνευση προσώπου

ανίχνευση προσώπου
definition: the task/process of recognizing that a person appears on a digital image or a video frame from a video source and possibly marking the contours around it @en
definition: η διαδικασία της αναγνώρισης ενός προσώπου που εμφανίζεται σε μια ψηφιακή είκονα ή πλάνο από μία πηγή βίντεο και της επισημείωσης των περιγραμμάτων γύρω από αυτό
preferred label: face detection @en
in scheme: Λεξικό CLARIN:EL
broader: λειτουργία με είσοδο ή έξοδο πολυμέσων
type: Concept