CLARIN:EL Dictionary
preferred label: Λεξικό CLARIN:EL @el
type: ConceptScheme

definition source
comment: Formal citation, e.g. identifier in external database to indicate / attribute source(s) for the definition. Free text indicate / attribute source(s) for the definition. EXAMPLE: Author Name, URI, MeSH Term C04, PUBMED ID, Wiki uri on 31.01.2007
label: πηγή ορισμού @el

information extraction
preferred label: εξαγωγή πληροφορίας @el
type: Concept
narrower: fake news detection

fake news detection
definition source: adapted from Wikipedia
type: Concept
alternative label: fake news evaluation
alternative label: fake news assessment
definition: η διαδικασία ανίχνευσης του εάν μία συγκεκριμένη είδηση είναι ψευδής (π.χ. μία είδηση κίτρινης δημοσιογραφίας ή προπαγάνδα που έχει ως σκοπό την παραπληροφόρηση ή εξαπάτηση και διαδίδεται μέσω των παραδοσιακών μέσων ενημέρωσης ή των μέσων κοινωνικής δικτύωσης) @el
definition: the process of detecting whether a certain news item is fake (i.e. a type of news items of yellow journalism or propaganda that consists of deliberate disinformation or hoaxes spread via traditional news media or online social media)
preferred label: ανίχνευση ψευδών ειδήσεων @el
broader: information extraction
in scheme: CLARIN:EL Dictionary