translation
preferred label: μετάφραση @el
type: Concept
narrower: image translation

definition source
comment: Formal citation, e.g. identifier in external database to indicate / attribute source(s) for the definition. Free text indicate / attribute source(s) for the definition. EXAMPLE: Author Name, URI, MeSH Term C04, PUBMED ID, Wiki uri on 31.01.2007
label: πηγή ορισμού @el

CLARIN:EL Dictionary
preferred label: Λεξικό CLARIN:EL @el
type: ConceptScheme

image translation
definition source: adapted from https://en.wikipedia.org/wiki/Image_translation
definition: the automatic extraction of text contained in an image (e.g. by OCR technology), its subsequent translation into another language, followed by a digital image processing step in order to reconstruct the original image with the translated text
definition: η αυτόματη εξαγωγή κειμένου που περιέχεται σε μια εικόνα (π.χ. με τεχνολογία OCR), η μετάφρασή του σε μία διαφορετική γλώσσα και τέλος η ψηφιακή επεξεργασία της αρχικής/πρωτότυπης εικόνας με σκοπό την εισαγωγή του μεταφρασμένου κειμένου @el
preferred label: μετάφραση εικόνας @el
in scheme: CLARIN:EL Dictionary
broader: translation
type: Concept