natural language generation
preferred label: παραγωγή φυσικής γλώσσας @el
type: Concept
narrower: lexical substitution

CLARIN:EL Dictionary
preferred label: Λεξικό CLARIN:EL @el
type: ConceptScheme

definition source
comment: Formal citation, e.g. identifier in external database to indicate / attribute source(s) for the definition. Free text indicate / attribute source(s) for the definition. EXAMPLE: Author Name, URI, MeSH Term C04, PUBMED ID, Wiki uri on 31.01.2007
label: πηγή ορισμού @el

paraphrasing
preferred label: παράφραση @el
type: Concept

lexical substitution
definition: the task of identifying a substitute for a word in the context of a clause
definition: η διαδικασία αντικατάστασης μία λέξης με μία άλλη στο πλαίσιο ενός συγκεκριμένου συγκείμενου/πρότασης @el
broader: natural language generation
preferred label: γλωσσική υποκατάσταση @el
related: paraphrasing
type: Concept
in scheme: CLARIN:EL Dictionary
definition source: Wikipedia