Λεξικό CLARIN:EL
preferred label: CLARIN:EL Dictionary @en
type: ConceptScheme

έννοια για υποδομές γλωσσικών πόρων και γλωσσικής τεχνολογίας
preferred label: language resources and technology infrastructure concept @en
type: Concept
narrower: λεξικό

λεξικό
source: portal
source: documentation
definition: (a list of) all the words used in a particular language or subject, or a dictionary @en
definition: κατάλογος όλων των λέξεων που χρησιμοποιούνται σε μια συγκεκριμένη γλώσσα ή σε ένα συγκεκριμένο θέμα
preferred label: lexicon @en
in scheme: Λεξικό CLARIN:EL
broader: έννοια για υποδομές γλωσσικών πόρων και γλωσσικής τεχνολογίας
type: Concept