κατάρτιση λεξικού
broader: λειτουργία υποστήριξης πόρων γνώσης
alternative label: δημιουργία λεξικού
alternative label: lexicon Development @en
in scheme: Λεξικό CLARIN:EL
definition: the task/process of constructing lexical resources (e.g. dictionaries, computational lexica, glossaries, etc.) @en
definition: η διαδικασία δημιουργίας/κατασκευής λεξικών πόρων (π.χ. λεξικά, υπολογιστικά λεξικά, γλωσσάρια, κτλ.)
type: Concept
preferred label: lexicon creation @en
source: https://www.dept.aueb.gr/el/LessE4-GR

λειτουργία υποστήριξης πόρων γνώσης
preferred label: support operation for knowledge resources @en
type: Concept
narrower: κατάρτιση λεξικού

Λεξικό CLARIN:EL
preferred label: CLARIN:EL Dictionary @en
type: ConceptScheme