λεξικό αναγνώσιμο από μηχανή
source: portal
definition: a dictionary usually meant for humans in a form that a computer can process @en
definition: λεξικό που προορίζεται συνήθως για ανθρώπους σε μορφή που μπορεί να επεξεργαστεί ένας υπολογιστής
alternative label: μηχαναγνώσιμο λεξικό
preferred label: machine readable dictionary @en
in scheme: Λεξικό CLARIN:EL
broader: έννοια για υποδομές γλωσσικών πόρων και γλωσσικής τεχνολογίας
type: Concept

Λεξικό CLARIN:EL
preferred label: CLARIN:EL Dictionary @en
type: ConceptScheme

έννοια για υποδομές γλωσσικών πόρων και γλωσσικής τεχνολογίας
preferred label: language resources and technology infrastructure concept @en
type: Concept
narrower: λεξικό αναγνώσιμο από μηχανή