named entity recognition
preferred label: αναγνώριση ονοματικών οντοτήτων @el
type: Concept
narrower: named entity disambiguation

CLARIN:EL Dictionary
preferred label: Λεξικό CLARIN:EL @el
type: ConceptScheme

named entity disambiguation
definition: the task/process of selecting among candidate entities from a knowledge base (or other information resource) the ones to which the named entities in a text refer to
alternative label: NED
preferred label: αποσαφήνιση ονοματικών οντοτήτων @el
in scheme: CLARIN:EL Dictionary
broader: named entity recognition
type: Concept