ontology
source: portal
definition: a set of concepts and categories in a subject area or domain that shows their properties and the relations between them
definition: σύνολο εννοιών και κατηγοριών σε ένα θεματικό πεδίο ή τομέα που δείχνει τις ιδιότητές τους και τις σχέσεις μεταξύ τους @el
preferred label: οντολογία @el
in scheme: CLARIN:EL Dictionary
broader: language resources and technology infrastructure concept
type: Concept

CLARIN:EL Dictionary
preferred label: Λεξικό CLARIN:EL @el
type: ConceptScheme

language resources and technology infrastructure concept
preferred label: έννοια για υποδομές γλωσσικών πόρων και γλωσσικής τεχνολογίας @el
type: Concept
narrower: ontology