parallel sentence extraction
definition: the task/process of identifying parallel sentences (i.e. sentences that have the same sense in different languages) in parallel texts
preferred label: εξαγωγή παράλληλων προτάσεων @el
in scheme: CLARIN:EL Dictionary
broader: machine translation support
type: Concept

CLARIN:EL Dictionary
preferred label: Λεξικό CLARIN:EL @el
type: ConceptScheme

machine translation support
preferred label: υποστήριξη μηχανικής μετάφρασης @el
type: Concept
narrower: parallel sentence extraction