CLARIN:EL Dictionary
preferred label: Λεξικό CLARIN:EL @el
type: ConceptScheme

pseudonymization
type: Concept
in scheme: CLARIN:EL Dictionary
broader: support operation
definition: the processing of personal data in such a way that the data can no longer be attributed to a specific data subject without the use of additional information (from GDPR)
alternative label: pseudo-anonymisation
alternative label: pseudonymisation
alternative label: pseudo-anonymization
preferred label: ψευδο-ανωνυμοποίηση @el

support operation
preferred label: λειτουργία υποστήριξης @el
type: Concept
narrower: pseudonymization