CLARIN:EL Dictionary
preferred label: Λεξικό CLARIN:EL @el
type: ConceptScheme

semantic annotation
preferred label: σημασιολογική επισημείωση @el
type: Concept
narrower: semantic class labelling

semantic class labelling
definition: the task/process of classifying words in a text according to a set of semantic classes (types)
alternative label: semantic class tagging
alternative label: semantic class labeling
alternative label: semantic class annotation
broader: semantic annotation
preferred label: επισημείωση σημασιολογικών κλάσεων @el
in scheme: CLARIN:EL Dictionary
type: Concept