temporal expressions recognition
definition: the task/process of identifying temporal expressions (also called timex) in a text in order to extract temporal information
preferred label: αναγνώριση χρονικών εκφράσεων @el
in scheme: CLARIN:EL Dictionary
broader: information extraction
type: Concept

information extraction
preferred label: εξαγωγή πληροφορίας @el
type: Concept
narrower: temporal expressions recognition

CLARIN:EL Dictionary
preferred label: Λεξικό CLARIN:EL @el
type: ConceptScheme