transliteration
preferred label: μεταγραφή @el
definition source: vocabulary.com
definition: transliteration is the process of transferring a word from the alphabet of one language to another
alternative label: script conversion
alternative label: μετατροπή συστήματος γραφής @el
broader: support operation
broader: speech recognition
type: Concept
in scheme: CLARIN:EL Dictionary

support operation
preferred label: λειτουργία υποστήριξης @el
type: Concept
narrower: transliteration

CLARIN:EL Dictionary
preferred label: Λεξικό CLARIN:EL @el
type: ConceptScheme

definition source
comment: Formal citation, e.g. identifier in external database to indicate / attribute source(s) for the definition. Free text indicate / attribute source(s) for the definition. EXAMPLE: Author Name, URI, MeSH Term C04, PUBMED ID, Wiki uri on 31.01.2007
label: πηγή ορισμού @el

speech recognition
preferred label: αναγνώριση ομιλίας @el
type: Concept
narrower: transliteration