CLARIN:EL Dictionary
preferred label: Λεξικό CLARIN:EL @el
type: ConceptScheme

information extraction
preferred label: εξαγωγή πληροφορίας @el
type: Concept
narrower: verbal aggression analysis

verbal aggression analysis
preferred label: ανάλυση λεκτικής επιθετικότητας @el
alternative label: verbal aggression classification
alternative label: verbal aggression detection
alternative label: verbal aggression identification
in scheme: CLARIN:EL Dictionary
broader: information extraction
definition: the task/process of recognizing evidence and the target(s) of verbal aggression usually in social media texts
type: Concept