wordlist
source: portal
definition: a written collection of all words derived from a particular source, or sharing some other characteristic
definition: γραπτή συλλογή όλων των λέξεων που προέρχονται από μια συγκεκριμένη πηγή ή μοιράζονται κάποιο άλλο χαρακτηριστικό @el
alternative label: word list
preferred label: λίστα λέξεων @el
in scheme: CLARIN:EL Dictionary
broader: language resources and technology infrastructure concept
type: Concept

CLARIN:EL Dictionary
preferred label: Λεξικό CLARIN:EL @el
type: ConceptScheme

language resources and technology infrastructure concept
preferred label: έννοια για υποδομές γλωσσικών πόρων και γλωσσικής τεχνολογίας @el
type: Concept
narrower: wordlist