Microstructure feature
type: Class

Microstructure Feature Taxonomy
type: NamedIndividual
type: ConceptScheme

definition
type: Microstructure feature
type: NamedIndividual
type: Concept
label: определение @ru
label: definícia @sk
label: definitie @nl
label: definisjon @nn
label: definice @cs
label: определба @mk
label: määritelmä @fi
label: definíció @hu
label: definitsioon @et
label: Definición @gl
label: дефиниција @sr
label: skýring @is
label: definición @es
label: definicja @pl
label: definició @ca
label: definiție @ro
label: Definition @de
label: Дефиниция @bg
label: definição @pt
label: definizione @it
label: definīcija @lv
label: הגדרה @he
label: азначэнне @be
label: définition @fr
label: означення поняття @uk
label: definicija @sl
label: apibrėžtis @lt
label: Ορισμός @el
label: definizio @eu
narrower: differentia

differentia
type: NamedIndividual
type: Microstructure feature
type: Concept
lexbib wikibase entity: Q14462
comment: the specifying term or terms in an analytic, classical or logical definition, the term which qualifies or characterises the genus, one or more of the characteristic features which distinguish the word explained from the generic term (genus) of which it is considered a specific instance; also called differentia specifica (e.g. autumn/fall: the third season of the year, when crops and fruits are gathered and leaves fall).
comment: the specifying term or terms in an analytic, classical or logical definition, the term which qualifies or characterizes the genus, one or more of the characteristic features which distinguish the word explained from the generic term (genus) of which it is considered a specific instance; also called differentia specifica (e.g. autumn/fall: the third season of the year, when crops and fruits are gathered and leaves fall).
label: aðgreinir @is
label: diferență specifică @ro
label: cecha odróżniająca @pl
label: differentia specifica
label: eristav tunnus @et
label: megkülönböztető tulajdonság @hu
label: especificació @ca
label: diferenciacija @lt
label: diferenciación @es
alternative label: adskillende træk @da
alternative label: skirstymas @lt
alternative label: rasgo distintivo @es
alternative label: tret distintiu @ca
alternative label: diferencia @es
alternative label: diferențiere @ro
broader: definition
skos:inScheme: Microstructure Feature Taxonomy

skos:inScheme