differentia
comment: the specifying term or terms in an analytic, classical or logical definition, the term which qualifies or characterises the genus, one or more of the characteristic features which distinguish the word explained from the generic term (genus) of which it is considered a specific instance; also called differentia specifica (e.g. autumn/fall: the third season of the year, when crops and fruits are gathered and leaves fall).
comment: the specifying term or terms in an analytic, classical or logical definition, the term which qualifies or characterizes the genus, one or more of the characteristic features which distinguish the word explained from the generic term (genus) of which it is considered a specific instance; also called differentia specifica (e.g. autumn/fall: the third season of the year, when crops and fruits are gathered and leaves fall).
alternative label: adskillende træk @da
alternative label: skirstymas @lt
alternative label: rasgo distintivo @es
alternative label: tret distintiu @ca
alternative label: diferencia @es
alternative label: diferențiere @ro
preferred label: differentia specifica
preferred label: diferență specifică @ro
preferred label: especificació @ca
preferred label: aðgreinir @is
preferred label: diferenciación @es
preferred label: eristav tunnus @et
preferred label: cecha odróżniająca @pl
preferred label: diferenciacija @lt
preferred label: megkülönböztető tulajdonság @hu
broader: definition
lexbib wikibase entity: Q14462
type: NamedIndividual
type: Microstructure feature
type: Concept
skos:inScheme: Microstructure Feature Taxonomy

definition
label: определение @ru
label: definícia @sk
label: definitie @nl
label: definisjon @nn
label: definice @cs
label: определба @mk
label: määritelmä @fi
label: definíció @hu
label: definitsioon @et
label: Definición @gl
label: дефиниција @sr
label: skýring @is
label: definición @es
label: definicja @pl
label: definició @ca
label: definiție @ro
label: Definition @de
label: Дефиниция @bg
label: definição @pt
label: definizione @it
label: definīcija @lv
label: הגדרה @he
label: азначэнне @be
label: définition @fr
label: означення поняття @uk
label: definicija @sl
label: apibrėžtis @lt
label: Ορισμός @el
label: definizio @eu
type: Microstructure feature
type: NamedIndividual
type: Concept
narrower: differentia

Microstructure Feature Taxonomy
type: NamedIndividual
type: ConceptScheme

skos:inScheme

Microstructure feature
type: Class