Media Type
type: Class

Data format
type: Class

Data Format Taxonomy
type: Named individual
type: ConceptScheme

Machine Learning Model format
type: Data format
type: Media Type
type: Named individual
type: Concept
narrower: MLeap

MLeap
type: Concept
type: Named individual
type: Media Type
type: Data format
comment: Serialisation format for machine learning pipelines, supporting Spark, Scikit-learn and Tensorflow for training pipelines and exporting them to an MLeap Bundle
comment: Serialization format for machine learning pipelines, supporting Spark, Scikit-learn and Tensorflow for training pipelines and exporting them to an MLeap Bundle
broader: Machine Learning Model format
in scheme: Data Format Taxonomy

Named individual
type: Class