Media Type
type: Class

Data format
type: Class

Data Format Taxonomy
type: Named individual
type: ConceptScheme

Machine Learning Model format
type: Data format
type: Media Type
type: Named individual
type: Concept
narrower: Pickle

Pickle
type: Concept
type: Data format
type: Media Type
type: Named individual
comment: Python-specific serialization format that allows you to convert Python objects (like lists, dictionaries, classes, etc.) into a byte stream, which can then be stored in a file or transmitted over a network
comment: Python-specific serialisation format that allows you to convert Python objects (like lists, dictionaries, classes, etc.) into a byte stream, which can then be stored in a file or transmitted over a network
alternative label: PKL
broader: Machine Learning Model format
in scheme: Data Format Taxonomy

Named individual
type: Class