Serialised CAS
broader: UIMA CAS format
type: Named individual
type: Data format
type: Concept
type: Media Type
in scheme: Data Format Taxonomy
label: Serialized CAS
definition: The CAS is the native data model used by UIMA ; there are various ways of saving CAS data, using XMI, XCAS, or binary formats ; this is for the serialized format
definition: The CAS is the native data model used by UIMA ; there are various ways of saving CAS data, using XMI, XCAS, or binary formats ; this is for the serialised format

Media Type
type: Class

Named individual
type: Class

Data format
type: Class

Data Format Taxonomy
type: Named individual
type: ConceptScheme

UIMA CAS format
type: Data format
type: Media Type
type: Named individual
type: Concept
narrower: Serialised CAS