Annotation of derivational features
type: Model function
type: Named individual
type: Concept
comment: The task/process of adding annotations relevant to the derivational level of analysis (e.g. recognising derivational affixes, tagging their meaning etc.)
comment: The task/process of adding annotations relevant to the derivational level of analysis (e.g. recognizing derivational affixes, tagging their meaning etc.)
broader: Morphological annotation
in scheme: Model Function Taxonomy

Model function
type: Class

Model Function Taxonomy
type: Named individual
type: ConceptScheme

Morphological annotation
type: Model function
type: Named individual
type: Concept
narrower: Annotation of derivational features

Named individual
type: Class