Dialogue modelling
type: Model function
type: Named individual
type: Concept
comment: The task/process of building models of dialogues to be used in dialogue systems
label: Dialog modeling
in scheme: Model Function Taxonomy
scope note: A Dialogue model is a system that simulates the behavior of dialogue participants. This includes formal models that instantiate linguistic theories of dialogue interaction and statistical models of dialogue behaviors.
top concept of: Model Function Taxonomy

Model function
type: Class

Model Function Taxonomy
type: Named individual
type: ConceptScheme
has top concept: Dialogue modelling

Named individual
type: Class