Discourse annotation
type: Model function
type: Named individual
type: Concept
narrower: Discourse modeling

Named individual
type: Class

Discourse modeling
type: Model function
type: Named individual
type: Concept
comment: The task/process of building discourse models
broader: Discourse annotation
in scheme: Model Function Taxonomy
preferred label: Discourse modelling
scope note: Discourse modelling describes all aspects of the relations between groups of sentences in monologue (text), dialogue, or multiparty interactions, e.g. text coherence, rhetorical relations, intentional and attentional state, centering, dialogue moves, dialogue acts, argument structures and reference phenomena, to name just a few. Recently, with the growing interest in multimodal discourse processing, discourse models extend their reach beyond the modality speech/language to other modalities like gesture, gaze or haptics, and cover also cross-modal phenomena.

Model function
type: Class

Model Function Taxonomy
type: Named individual
type: ConceptScheme