Semantic annotation
type: Model function
type: Named individual
type: Concept
narrower: Frame-semantic parsing

Frame-semantic parsing
comment: The task/process of recognising and labelling in a text predicate argument structures and the semantic roles of the constituents, in accordance to the frame semantics theory.
comment: The task/process of recognising and labeling in a text predicate argument structures and the semantic roles of the constituents, in accordance to the frame semantics theory.
type: Concept
type: Model function
type: Named individual
in scheme: Model Function Taxonomy
broader: Semantic annotation
broader: Parsing

Parsing
type: Model function
type: Named individual
type: Concept
narrower: Frame-semantic parsing

Named individual
type: Class

Model function
type: Class

Model Function Taxonomy
type: Named individual
type: ConceptScheme