Constituency parsing
type: Operation
type: Named individual
type: Concept
comment: The task/process of identifying and marking constituents (phrases, governed by a head and including function words and/or modifiers ) in a text or text segment
alternative label: Natural Language Parsing
alternative label: Phrase parsing
broader: Parsing
definition: Parsing (from Latin ""pars orationis"" = parts of speech) is the syntactic analysis of languages. Natural Language Parsing is the syntactic analysis of natural languages, such as Finnish or Chinese. The objective of Natural Language Parsing is to determine parts of sentences (such as verbs, noun phrases, or relative clauses), and the relationships between them (such as subject or object). Unlike parsing of formally defined artificial languages (such as Java or predicate logic), parsing of natural languages presents problems due to ambiguity, and the productive and creative use of language.
in scheme: Operation Taxonomy

Operation
type: Class

Operation Taxonomy
type: Named individual
type: ConceptScheme

Parsing
type: Named individual
type: Operation
type: Concept
narrower: Constituency parsing

Text Processing Collection
type: Named individual
type: Operation
type: Collection
member: Constituency parsing

Named individual
type: Class