Emotion recognition
type: Operation
type: Concept
type: Named individual
comment: The recognition of emotions from text, speech, facial expressions, gestures and/or physiological measures
alternative label: Emotion detection
broader: Information Extraction
definition: The recognition of emotions from text, speech, facial expressions, gestures and/or physiological measures. A key challenge is the appropriate representation of emotional states.
in scheme: Operation Taxonomy

Information Extraction
type: Named individual
type: Operation
type: Concept
narrower: Emotion recognition

Information Extraction and Information Retrieval Collection
type: Named individual
type: Operation
type: Collection
member: Emotion recognition

Operation
type: Class

Operation Taxonomy
type: Named individual
type: ConceptScheme

Named individual
type: Class