Operation
type: Class

Operation Taxonomy
type: Named individual
type: ConceptScheme

Speaker identification
type: Concept
type: Named individual
type: Operation
comment: The task/process of identifying/recognizing who the person speaking is
comment: The task/process of identifying/recognising who the person speaking is
alternative label: Voice Recognition
alternative label: Speaker Recognition
alternative label: VR
alternative label: SR
broader: Speech Recognition
definition: Speaker recognition, which can be classified into identification and verification, is the process of automatically recognizing who is speaking on the basis of individual information included in speech waves. This technique makes it possible to use the speaker's voice to verify their identity and control access to services such as voice dialing, banking by telephone, telephone shopping, database access services, information services, voice mail, security control for confidential information areas, and remote access to computers.
definition: Speaker recognition, which can be classified into identification and verification, is the process of automatically recognising who is speaking on the basis of individual information included in speech waves. This technique makes it possible to use the speaker's voice to verify their identity and control access to services such as voice dialing, banking by telephone, telephone shopping, database access services, information services, voice mail, security control for confidential information areas, and remote access to computers.
in scheme: Operation Taxonomy

Speech Processing Collection
type: Named individual
type: Operation
type: Collection
member: Speaker identification

Speech Recognition
type: Named individual
type: Operation
type: Concept
narrower: Speaker identification

Named individual
type: Class